Target
Histamine H3 receptor
Ligand
BDBM50050178
Substrate
Meas. Tech.
ChEMBL_83829 (CHEMBL692770)
Ki
16±n/a nM
Citation
 Stark, HPurand, KHüls, ALigneau, XGarbarg, MSchwartz, JCSchunack, W [125I]iodoproxyfan and related compounds: a reversible radioligand and novel classes of antagonists with high affinity and selectivity for the histamine H3 receptor. J Med Chem 39:1220-6 (1996)  
Target
Name:
Histamine H3 receptor
Synonyms:
HH3R Hrh3
Type:
G Protein-Coupled Receptor (GPCR)
Mol. Mass.:
48607.98
Organism:
Rattus norvegicus (rat)
Description:
Residue:
445
  
Inhibitor
Name:
BDBM50050178
Synonyms:
4-[3-(3-Iodo-phenoxy)-propyl]-1H-imidazole | CHEMBL440788
Type:
Small organic molecule
Emp. Form.:
C12H13IN2O
Mol. Mass.:
328.1489
SMILES:
Ic1cccc(OCCCc2cnc[nH]2)c1
: