Target
Dihydrofolate reductase
Ligand
BDBM50050399
Substrate
Meas. Tech.
ChEMBL_55115 (CHEMBL665442)
IC50
320±n/a nM
Citation
 Piper, JRJohnson, CAKrauth, CACarter, RLHosmer, CAQueener, SFBorotz, SEPfefferkorn, ER Lipophilic antifolates as agents against opportunistic infections. 1. Agents superior to trimetrexate and piritrexim against Toxoplasma gondii and Pneumocystis carinii in in vitro evaluations. J Med Chem 39:1271-80 (1996)  
Target
Name:
Dihydrofolate reductase
Synonyms:
DYR_RAT Dihydrofolate reductase (DHFR) Tetrahydrofolate dehydrogenase
Type:
Enzyme
Mol. Mass.:
21638.84
Organism:
Rattus norvegicus (rat)
Description:
Residue:
187
  
Inhibitor
Name:
BDBM50050399
Synonyms:
6-[(2-Methoxy-6-methyl-phenylamino)-methyl]-5-methyl-pyrido[2,3-d]pyrimidine-2,4-diamine | CHEMBL281131
Type:
Small organic molecule
Emp. Form.:
C17H20N6O
Mol. Mass.:
324.3803
SMILES:
COc1cccc(C)c1NCc1cnc2nc(N)nc(N)c2c1C
: