Target
Endothelin-1 receptor
Ligand
BDBM50050976
Substrate
Meas. Tech.
ChEMBL_65653 (CHEMBL678073)
Ki
0.069000±n/a nM
Citation
 Winn, Mvon Geldern, TWOpgenorth, TJJae, HSTasker, ASBoyd, SAKester, JAMantei, RABal, RSorensen, BKWu-Wong, JRChiou, WJDixon, DBNovosad, EIHernandez, LMarsh, KC 2,4-Diarylpyrrolidine-3-carboxylic acids--potent ETA selective endothelin receptor antagonists. 1. Discovery of A-127722. J Med Chem 39:1039-48 (1996)  
Target
Name:
Endothelin-1 receptor
Synonyms:
EDNRA ET-A ETA-R Endothelin receptor type A hET-AR
Type:
Enzyme Catalytic Domain
Mol. Mass.:
48736.88
Organism:
Homo sapiens (Human)
Description:
P25101
Residue:
427
  
Inhibitor
Name:
BDBM50050976
Synonyms:
4-Benzo[1,3]dioxol-5-yl-1-dibutylcarbamoylmethyl-2-(4-methoxy-phenyl)-pyrrolidine-3-carboxylic acid | CHEMBL8923
Type:
Small organic molecule
Emp. Form.:
C29H38N2O6
Mol. Mass.:
510.6218
SMILES:
CCCCN(CCCC)C(=O)CN1CC(C(C1c1ccc(OC)cc1)C(O)=O)c1ccc2OCOc2c1
: