Target
Mu-type opioid receptor
Ligand
BDBM50051171
Substrate
Meas. Tech.
ChEMBL_146987 (CHEMBL757525)
IC50
400±n/a nM
Citation
 Lung, FDCollins, NStropova, DDavis, PYamamura, HIPorreca, FHruby, VJ Design, synthesis, and biological activities of cyclic lactam peptide analogues of dynorphine A(1-11)-NH2. J Med Chem 39:1136-41 (1996)  
Target
Name:
Mu-type opioid receptor
Synonyms:
M-OR-1 Mu opioid receptor OPIATE Mu OPRM_CAVPO
Type:
Enzyme Catalytic Domain
Mol. Mass.:
11165.58
Organism:
GUINEA PIG
Description:
P97266
Residue:
98
  
Inhibitor
Name:
BDBM50051171
Synonyms:
CHEMBL384485 | Cyclic Lactam Peptide Analogues of Dynorphin A(1-11)-NH2
Type:
Small organic molecule
Emp. Form.:
C61H98N20O14
Mol. Mass.:
1335.5564
SMILES:
CC[C@H](C)[C@H](NC(=O)[C@H](CCCNC(N)=N)NC(=O)[C@H](CCCNC(N)=N)NC(=O)[C@H](CCCCN)NC(=O)[C@H](Cc1ccccc1)NC(=O)CNC(=O)CNC(=O)[C@@H](N)Cc1ccc(O)cc1)C(=O)N[C@@H](CC(O)=O)C(=O)N1CCC[C@@H]1C(=O)N[C@H](CCCCN)C(N)=O
: