Target
Delta-type opioid receptor
Ligand
BDBM50051173
Substrate
Meas. Tech.
ChEMBL_146879 (CHEMBL750006)
IC50
1.2±n/a nM
Citation
 Lung, FDCollins, NStropova, DDavis, PYamamura, HIPorreca, FHruby, VJ Design, synthesis, and biological activities of cyclic lactam peptide analogues of dynorphine A(1-11)-NH2. J Med Chem 39:1136-41 (1996)  
Target
Name:
Delta-type opioid receptor
Synonyms:
D-OR-1 Delta opioid receptor OPIATE Delta OPRD1 OPRK1 | opioid receptor, delta 1
Type:
G Protein-Coupled Receptor (GPCR)
Mol. Mass.:
40382.98
Organism:
Homo sapiens (Human)
Description:
Competition binding assays were carried out using membrane preparations from transfected HN9.10 cells that constitutively expressed the delta opioid receptor.
Residue:
372
  
Inhibitor
Name:
BDBM50051173
Synonyms:
CHEMBL217049 | Cyclic Lactam Peptide Analogues of Dynorphin A(1-11)-NH2
Type:
Small organic molecule
Emp. Form.:
C65H106N20O14
Mol. Mass.:
1391.6627
SMILES:
CC[C@H](C)[C@H](NC(=O)[C@H](CCCNC(N)=N)NC(=O)[C@H](CCCCN)NC(=O)[C@H](CC(C)C)NC(=O)[C@H](Cc1ccccc1)NC(=O)CNC(=O)[C@H](CC(O)=O)NC(=O)[C@@H](N)Cc1ccc(O)cc1)C(=O)N[C@@H](CCCNC(N)=N)C(=O)N1CCC[C@@H]1C(=O)N[C@H](CCCCN)C(N)=O
: