Target
Kappa-type opioid receptor
Ligand
BDBM50051179
Substrate
Meas. Tech.
ChEMBL_145923 (CHEMBL752591)
IC50
18±n/a nM
Citation
 Lung, FDCollins, NStropova, DDavis, PYamamura, HIPorreca, FHruby, VJ Design, synthesis, and biological activities of cyclic lactam peptide analogues of dynorphine A(1-11)-NH2. J Med Chem 39:1136-41 (1996)  
Target
Name:
Kappa-type opioid receptor
Synonyms:
Kappa Opioid Receptor OPRK1 Opiate Kappa 1 | mu/kappa opioid receptor
Type:
G Protein-Coupled Receptor (GPCR)
Mol. Mass.:
42744.99
Organism:
Cavia porcellus (domestic guinea pig)
Description:
P41144
Residue:
380
  
Inhibitor
Name:
BDBM50051179
Synonyms:
CHEMBL412580 | Cyclic Lactam Peptide Analogues of Dynorphin A(1-11)-NH2
Type:
Small organic molecule
Emp. Form.:
C61H98N20O14
Mol. Mass.:
1335.5564
SMILES:
CC[C@H](C)[C@H](NC(=O)[C@H](CCCNC(N)=N)NC(=O)[C@H](CCCNC(N)=N)NC(=O)[C@H](CCCCN)NC(=O)[C@H](Cc1ccccc1)NC(=O)CNC(=O)CNC(=O)[C@@H](N)Cc1ccc(O)cc1)C(=O)N[C@H](CC(O)=O)C(=O)N1CCC[C@@H]1C(=O)N[C@H](CCCCN)C(N)=O
: