Target
Acyl-CoA:cholesterol acyltransferase
Ligand
BDBM50051884
Substrate
Meas. Tech.
ChEMBL_28783 (CHEMBL641693)
IC50
75±n/a nM
Citation
 Astles, PCAshton, MJBridge, AWHarris, NVHart, TWParrott, DPPorter, BRiddell, DSmith, CWilliams, RJ Acyl-CoA:Cholesterol O-acyltransferase (ACAT) inhibitors. 2. 2-(1,3-Dioxan-2-yl)-4,5-diphenyl-1H-imidazoles as potent inhibitors of ACAT. J Med Chem 39:1423-32 (1996)  
Target
Name:
Acyl-CoA:cholesterol acyltransferase
Synonyms:
ACAT
Type:
Mol. Mass.:
35405.31
Organism:
Oryctolagus cuniculus
Description:
Residue:
305
  
Inhibitor
Name:
BDBM50051884
Synonyms:
1-[5-(4,5-Diphenyl-1H-imidazole-2-sulfinyl)-pentyl]-3,5-dimethyl-1H-pyrazole Diphenylimidazole analogue
Type:
Small organic molecule
Emp. Form.:
C25H28N4OS
Mol. Mass.:
432.581
SMILES:
Cc1cc(C)n(CCCCCS(=O)c2nc(c([nH]2)-c2ccccc2)-c2ccccc2)n1
: