Target
Translocator protein
Ligand
BDBM50054126
Substrate
Meas. Tech.
ChEMBL_39462 (CHEMBL653037)
IC50
140±n/a nM
Citation
 Anzini, MCappelli, AVomero, SGiorgi, GLanger, TBruni, GRomeo, MRBasile, AS Molecular basis of peripheral vs central benzodiazepine receptor selectivity in a new class of peripheral benzodiazepine receptor ligands related to alpidem. J Med Chem 39:4275-84 (1996)  
Target
Name:
Translocator protein
Synonyms:
Benzodiazepine receptors; peripheral & central Mbr PBR Peripheral benzodiazepine receptor (PBR) TSPO_RAT | Tspo
Type:
Mitochondrion membrane protein
Mol. Mass.:
18945.84
Organism:
Rattus norvegicus (rat)
Description:
Competitive binding experiments were performed on rat kidney mitochondrial membranes.
Residue:
169
  
Inhibitor
Name:
BDBM50054126
Synonyms:
(E)-N-(4-chlorophenyl)-2-(2-(4-chlorophenyl)-1-oxo-1,2-dihydropyrrolo[3,4-b]quinolin-3-ylidene)-N-methylacetamide N-(4-Chloro-phenyl)-2-[2-(4-chloro-phenyl)-1-oxo-1,2-dihydro-pyrrolo[3,4-b]quinolin-(3E)-ylidene]-N-methyl-acetamide
Type:
Small organic molecule
Emp. Form.:
C26H17Cl2N3O2
Mol. Mass.:
474.338
SMILES:
CN(C(=O)\C=C1\N(C(=O)c2cc3ccccc3nc12)c1ccc(Cl)cc1)c1ccc(Cl)cc1
: