Target
5-hydroxytryptamine receptor 1A
Ligand
BDBM50056025
Substrate
Meas. Tech.
ChEMBL_1130 (CHEMBL616075)
Ki
4.5±n/a nM
Citation
 Kuipers, WKruse, CGvan Wijngaarden, IStandaar, PJTulp, MTVeldman, NSpek, ALIJzerman, AP 5-HT1A-versus D2-receptor selectivity of flesinoxan and analogous N4-substituted N1-arylpiperazines. J Med Chem 40:300-12 (1997)  
Target
Name:
5-hydroxytryptamine receptor 1A
Synonyms:
5-HT-1A 5-HT1A 5-hydroxytryptamine receptor 1A (5HT1A) 5ht1a Htr1a Serotonin 1a (5-HT1a) receptor/Adrenergic receptor alpha-1 | Serotonin receptor 1A
Type:
G Protein-Coupled Receptor (GPCR)
Mol. Mass.:
46445.29
Organism:
Rattus norvegicus (rat)
Description:
Binding assays were performed using rat hippocampal membranes.
Residue:
422
  
Inhibitor
Name:
BDBM50056025
Synonyms:
CHEMBL107903 | N-{2-[4-(2-Methoxy-phenyl)-piperazin-1-yl]-ethyl}-cyclohexanecarboxamidine
Type:
Small organic molecule
Emp. Form.:
C20H32N4O
Mol. Mass.:
344.4943
SMILES:
COc1ccccc1N1CCN(CCNC(=N)C2CCCCC2)CC1
: