Target
5-hydroxytryptamine receptor 1A
Ligand
BDBM50056376
Substrate
Meas. Tech.
ChEMBL_863 (CHEMBL615919)
IC50
0.5±n/a nM
Citation
 Modica, MSantagati, MRusso, FParotti, LDe Gioia, LSelvaggini, CSalmona, MMennini, T [[(Arylpiperazinyl)alkyl]thio]thieno[2,3-d]pyrimidinone derivatives as high-affinity, selective 5-HT1A receptor ligands. J Med Chem 40:574-85 (1997)  
Target
Name:
5-hydroxytryptamine receptor 1A
Synonyms:
5-HT-1A 5-HT1A 5-hydroxytryptamine receptor 1A (5HT1A) 5ht1a Htr1a Serotonin 1a (5-HT1a) receptor/Adrenergic receptor alpha-1 | Serotonin receptor 1A
Type:
G Protein-Coupled Receptor (GPCR)
Mol. Mass.:
46445.29
Organism:
Rattus norvegicus (rat)
Description:
Binding assays were performed using rat hippocampal membranes.
Residue:
422
  
Inhibitor
Name:
BDBM50056376
Synonyms:
3-Amino-2-{3-[4-(2-methoxy-phenyl)-piperazin-1-yl]-propylsulfanyl}-3H-quinazolin-4-one | CHEMBL347623
Type:
Small organic molecule
Emp. Form.:
C22H27N5O2S
Mol. Mass.:
425.547
SMILES:
COc1ccccc1N1CCN(CCCSc2nc3ccccc3c(=O)n2N)CC1
: