Target
Neutrophil elastase
Ligand
BDBM50031201
Substrate
Meas. Tech.
ChEMBL_63796 (CHEMBL679049)
IC50
34±n/a nM
Citation
 Portevin, BLonchampt, MCanet, EDe Nanteuil, G Dual inhibition of human leukocyte elastase and lipid peroxidation: in vitro and in vivo activities of azabicyclo[2.2.2]octane and perhydroindole derivatives. J Med Chem 40:1906-18 (1997)  
Target
Name:
Neutrophil elastase
Synonyms:
Bone marrow serine protease Coagulation factor X ELANE Elastase HLE Leukocyte elastase Medullasin Neutrophil elastase (HNE) PMN elastase Trypsin
Type:
Enzyme
Mol. Mass.:
28532.38
Organism:
Homo sapiens (Human)
Description:
P08246
Residue:
267
  
Inhibitor
Name:
BDBM50031201
Synonyms:
(S)-1-{(S)-2-[4-(4-Chloro-benzenesulfonylaminocarbonyl)-benzoylamino]-3-methyl-butyryl}-pyrrolidine-2-carboxylic acid ((S)-3,3,3-trifluoro-1-isopropyl-2-oxo-propyl)-amide | CHEMBL340818
Type:
Small organic molecule
Emp. Form.:
C30H34ClF3N4O7S
Mol. Mass.:
687.127
SMILES:
CC(C)[C@H](NC(=O)c1ccc(cc1)C(=O)NS(=O)(=O)c1ccc(Cl)cc1)C(=O)N1CCC[C@H]1C(=O)N[C@@H](C(C)C)C(=O)C(F)(F)F
: