Target
Caspase-1
Ligand
BDBM50058526
Substrate
Meas. Tech.
ChEMBL_90980 (CHEMBL696527)
Ki
1±n/a nM
Citation
 Dolle, REPrasad, CVProuty, CPSalvino, JMAwad, MMSchmidt, SJHoyer, DRoss, TMGraybill, TLSpeier, GJUhl, JMiller, BEHelaszek, CTAtor, MA Pyridazinodiazepines as a high-affinity, P2-P3 peptidomimetic class of interleukin-1 beta-converting enzyme inhibitor. J Med Chem 40:1941-6 (1997)  
Target
Name:
Caspase-1
Synonyms:
CASP1 Caspase ICE IL1BCE Interleukin-1 beta-converting enzyme
Type:
Enzyme
Mol. Mass.:
45154.13
Organism:
Homo sapiens (Human)
Description:
P29466
Residue:
404
  
Inhibitor
Name:
BDBM50058526
Synonyms:
(S)-3-{[(1S,9S)-9-(4-Carboxymethoxy-benzoylamino)-6,10-dioxo-octahydro-pyridazino[1,2-a][1,2]diazepine-1-carbonyl]-amino}-4-oxo-butyric acid | CHEMBL293979
Type:
Small organic molecule
Emp. Form.:
C23H26N4O10
Mol. Mass.:
518.4733
SMILES:
OC(=O)COc1ccc(cc1)C(=O)N[C@H]1CCC(=O)N2CCC[C@H](N2C1=O)C(=O)N[C@@H](CC(O)=O)C=O
: