Target
Potassium voltage-gated channel subfamily H member 2
Ligand
BDBM50275436
Substrate
Meas. Tech.
ChEMBL_1829703 (CHEMBL4329577)
Ki
13000±n/a nM
Citation
 Londregan, ATAspnes, GLimberakis, CLoria, PMMcClure, KFPetersen, DNRaymer, BRuggeri, RBWei, LXiao, JPiotrowski, DW Discovery of N-(piperidin-3-yl)-N-(pyridin-2-yl)piperidine/piperazine-1-carboxamides as small molecule inhibitors of PCSK9. Bioorg Med Chem Lett 28:3685-3688 (2018)  
Target
Name:
Potassium voltage-gated channel subfamily H member 2
Synonyms:
1,3-beta-glucan synthase component GLS2 ERG Eag-related protein 1 Ether-a-go-go-related gene (HERG) Ether-a-go-go-related gene potassium channel 1 Ether-a-go-go-related gene potassium channel 1 (hERG1) Ether-a-go-go-related protein 1 H-ERG KCNH2 Potassium voltage-gated channel subfamily H member 2 (hERG) Voltage-gated potassium channel subunit Kv11.1 hERG Potassium Channel 1 | putative potassium channel subunit
Type:
Multi-pass membrane protein
Mol. Mass.:
126672.65
Organism:
Homo sapiens (Human)
Description:
Q12809
Residue:
1159
  
Inhibitor
Name:
BDBM50275436
Synonyms:
CHEMBL4128250
Type:
Small organic molecule
Emp. Form.:
C24H27N3O2
Mol. Mass.:
389.4901
SMILES:
COc1ccc(CCC(=O)N([C@@H]2CCCNC2)c2nccc3ccccc23)cc1
: