Target
Neuropeptide Y receptor type 5
Ligand
BDBM50060728
Substrate
Meas. Tech.
ChEMBL_144126 (CHEMBL750099)
Ki
>10000±n/a nM
Citation
 Hipskind, PALobb, KLNixon, JABritton, TCBruns, RFCatlow, JDieckman-McGinty, DKGackenheimer, SLGitter, BDIyengar, SSchober, DASimmons, RMSwanson, SZarrinmayeh, HZimmerman, DMGehlert, DR Potent and selective 1,2,3-trisubstituted indole NPY Y-1 antagonists. J Med Chem 40:3712-4 (1997)  
Target
Name:
Neuropeptide Y receptor type 5
Synonyms:
NPY-Y5 NPY5-R NPY5R_HUMAN NPYY5 Neuropeptide Y receptor type 5 ( NPY Y5) | Y5 receptor
Type:
Enzyme
Mol. Mass.:
50746.64
Organism:
Homo sapiens (Human)
Description:
Q15761
Residue:
445
  
Inhibitor
Name:
BDBM50060728
Synonyms:
(R)-2-(2,2-diphenylacetamido)-5-guanidino-N-(4-hydroxybenzyl)pentanamide (R)-5-(diaminomethyleneamino)-2-(2,2-diphenylacetamido)-N-(4-hydroxybenzyl)pentanamide | CHEMBL332347
Type:
Small organic molecule
Emp. Form.:
C27H31N5O3
Mol. Mass.:
473.5667
SMILES:
[#7]\[#6](-[#7])=[#7]\[#6]-[#6]-[#6]-[#6@@H](-[#7]-[#6](=O)-[#6](-c1ccccc1)-c1ccccc1)-[#6](=O)-[#7]-[#6]-c1ccc(-[#8])cc1
: