Target
Adenosine receptor A1
Ligand
BDBM50065763
Substrate
Meas. Tech.
ChEMBL_29303 (CHEMBL640364)
Ki
89.8±n/a nM
Citation
 Kim, YCde Zwart, MChang, LMoro, Svon Frijtag Drabbe Künzel, JKMelman, NIJzerman, APJacobson, KA Derivatives of the triazoloquinazoline adenosine antagonist (CGS 15943) having high potency at the human A2B and A3 receptor subtypes. J Med Chem 41:2835-45 (1998)  
Target
Name:
Adenosine receptor A1
Synonyms:
AA1R_RAT ADENOSINE A1 high Adenosine A1 receptor (A1) Adenosine receptors A1 | Adora1
Type:
Protein
Mol. Mass.:
36704.13
Organism:
Rattus norvegicus (rat)
Description:
Residue:
326
  
Inhibitor
Name:
BDBM50065763
Synonyms:
3-Amino-N-(9-chloro-2-furan-2-yl-[1,2,4]triazolo[1,5-c]quinazolin-5-yl)-propionamide | CHEMBL97961
Type:
Small organic molecule
Emp. Form.:
C16H13ClN6O2
Mol. Mass.:
356.766
SMILES:
NCCC(=O)Nc1nc2ccc(Cl)cc2c2nc(nn12)-c1ccco1
: