Target
Adenosine receptor A2a
Ligand
BDBM50004566
Substrate
Meas. Tech.
ChEMBL_30000 (CHEMBL643011)
Ki
3.3±n/a nM
Citation
 Kim, YCde Zwart, MChang, LMoro, Svon Frijtag Drabbe Künzel, JKMelman, NIJzerman, APJacobson, KA Derivatives of the triazoloquinazoline adenosine antagonist (CGS 15943) having high potency at the human A2B and A3 receptor subtypes. J Med Chem 41:2835-45 (1998)  
Target
Name:
Adenosine receptor A2a
Synonyms:
AA2AR_RAT Adenosine A2 receptor Adenosine Receptors A2a (A2a) Adenosine receptors A2a Rat striatal adenosine A2a receptor
Type:
G Protein-Coupled Receptor (GPCR)
Mol. Mass.:
45015.65
Organism:
Rattus norvegicus (rat)
Description:
Rat A2A receptors expressed in CHO cells.
Residue:
410
  
Inhibitor
Name:
BDBM50004566
Synonyms:
9-Chloro-2-furan-2-yl-[1,2,4]triazolo[1,5-c]quinazolin-5-ylamine 9-Chloro-[1,2,4]triazolo[1,5-c]quinazolin-5-ylamine(CGS 15943) 9-chloro-2-(furan-2-yl)-[1,2,4]triazolo[1,5-c]quinazolin-5-amine CHEMBL16687 Nonnucleoside analog, 4
Type:
Small organic molecule
Emp. Form.:
C13H8ClN5O
Mol. Mass.:
285.689
SMILES:
Nc1nc2ccc(Cl)cc2c2nc(nn12)-c1ccco1
: