Target
Alpha-2A adrenergic receptor
Ligand
BDBM50514737
Substrate
Meas. Tech.
ChEMBL_1858221 (CHEMBL4358950)
Ki
0.041687±n/a nM
Target
Name:
Alpha-2A adrenergic receptor
Synonyms:
ADA2A_HUMAN ADRA2R Alpha-2 adrenergic receptor subtype C10 Alpha-2A adrenoreceptor | Alpha-2AAR
Type:
PROTEIN
Mol. Mass.:
50668.79
Organism:
Homo sapiens
Description:
ChEMBL_117056
Residue:
465
  
Inhibitor
Name:
BDBM50514737
Synonyms:
CHEMBL4482861
Type:
Small organic molecule
Emp. Form.:
C22H23N2O5P
Mol. Mass.:
426.4022
SMILES:
CCOP(=O)(OCC)C1(N=CC2C1C(=O)N(C2=O)c1ccccc1)c1ccccc1
: