Target
N-lysine methyltransferase SMYD2
Ligand
BDBM50519299
Substrate
Meas. Tech.
ChEMBL_1874854 (CHEMBL4376143)
IC50
23±n/a nM
Citation
 Taylor, APSwewczyk, MKennedy, STrush, VVWu, HZeng, HDong, AFerreira de Freitas, RTatlock, JKumpf, RAWythes, MCasimiro-Garcia, ADenny, RAParikh, MDLi, FBarsyte-Lovejoy, DSchapira, MVedadi, MBrown, PJArrowsmith, CHOwen, DR Selective, Small-Molecule Co-Factor Binding Site Inhibition of a Su(var)3-9, Enhancer of Zeste, Trithorax Domain Containing Lysine Methyltransferase. J Med Chem 62:7669-7683 (2019)  
Target
Name:
N-lysine methyltransferase SMYD2
Synonyms:
HSKM-B KMT3C N-lysine methyltransferase SMYD2 SET and MYND domain-containing protein 2 (SMYD2) SMYD2_HUMAN
Type:
Enzyme
Mol. Mass.:
49689.57
Organism:
Homo sapiens (Human)
Description:
Q9NRG4
Residue:
433
  
Inhibitor
Name:
BDBM50519299
Synonyms:
CHEMBL4536230
Type:
Small organic molecule
Emp. Form.:
C27H36N8O
Mol. Mass.:
488.6277
SMILES:
Cc1nc(N)c2ncn(C3CN(C3)C(=O)c3ccn(CC4CCN(CC4)C4CCCCC=C4)c3)c2n1
: