Target
Somatostatin receptor type 2
Ligand
BDBM50075278
Substrate
Meas. Tech.
ChEBML_200690
Ki
2±n/a nM
Citation
 Pasternak, APan, YMarino, DSanderson, PEMosley, RRohrer, SPBirzin, ETHuskey, SEJacks, TSchleim, KDCheng, KSchaeffer, JMPatchett, AAYang, L Potent, orally bioavailable somatostatin agonists: good absorption achieved by urea backbone cyclization. Bioorg Med Chem Lett 9:491-6 (1999)  
Target
Name:
Somatostatin receptor type 2
Synonyms:
SOMATOSTATIN SST2 Smstr2 Somatostatin receptor 2 Sst2 | Sstr2
Type:
Enzyme Catalytic Domain
Mol. Mass.:
41234.26
Organism:
MOUSE
Description:
SOMATOSTATIN SST2 SSTR2 MOUSE::P30875
Residue:
369
  
Inhibitor
Name:
BDBM50075278
Synonyms:
CHEMBL147319 | methyl 6-amino-2-[2-(1H-3-indolyl)-1-spiro[2,3-dihydro-1H-indene-1,4'-(hexahydropyridine)]-1-ylcarboxamido-(1R)-ethylcarboxamido]-(2R)-hexanoate
Type:
Small organic molecule
Emp. Form.:
C32H41N5O4
Mol. Mass.:
559.699
SMILES:
COC(=O)[C@@H](CCCCN)NC(=O)[C@@H](Cc1c[nH]c2ccccc12)NC(=O)N1CCC2(CCc3ccccc23)CC1
: