Target
Serine protease 1
Ligand
BDBM50076224
Substrate
Meas. Tech.
ChEMBL_212323 (CHEMBL818250)
Ki
0.073±n/a nM
Citation
 Boatman, PDOgbu, COEguchi, MKim, HONakanishi, HCao, BShea, JPKahn, M Secondary structure peptide mimetics: design, synthesis, and evaluation of beta-strand mimetic thrombin inhibitors. J Med Chem 42:1367-75 (1999)  
Target
Name:
Serine protease 1
Synonyms:
Beta-Trypsin PRSS1 TRY1 TRYP1 Trypsin I
Type:
Enzyme
Mol. Mass.:
25790.52
Organism:
Bos taurus (bovine)
Description:
P00760
Residue:
246
  
Inhibitor
Name:
BDBM50076224
Synonyms:
(1S,7S)-7-Amino-7-benzyl-hexahydro-pyrazolo[1,2-a]pyridazine-1-carboxylic acid ((S)-1-benzylaminooxalyl-4-guanidino-butyl)-amide | CHEMBL28365
Type:
Small organic molecule
Emp. Form.:
C29H40N8O3
Mol. Mass.:
548.6797
SMILES:
NC(=N)NCCC[C@H](NC(=O)[C@@H]1CCN2CC[C@@](N)(Cc3ccccc3)CN12)C(=O)C(=O)NCc1ccccc1
: