Target
Sphingomyelin phosphodiesterase 3
Ligand
BDBM50521423
Substrate
Meas. Tech.
ChEMBL_1884279 (CHEMBL4385861)
IC50
320±n/a nM
Citation
 Stepanek, OHin, NThomas, AGDash, RPAlt, JRais, RRojas, CSlusher, BSTsukamoto, T Neutral sphingomyelinase 2 inhibitors based on the 4-(1H-imidazol-2-yl)-2,6-dialkoxyphenol scaffold. Eur J Med Chem 170:276-289 (2019)  
Target
Name:
Sphingomyelin phosphodiesterase 3
Synonyms:
3.1.4.12 Neutral sphingomyelinase 2 SMPD3 nSMase-2 | nSMase2
Type:
PROTEIN
Mol. Mass.:
71072.54
Organism:
Homo sapiens
Description:
ChEMBL_119220
Residue:
655
  
Inhibitor
Name:
BDBM50521423
Synonyms:
CHEMBL4556374
Type:
Small organic molecule
Emp. Form.:
C20H16N2O2S
Mol. Mass.:
348.418
SMILES:
COc1cc(ccc1O)-c1nc(c([nH]1)-c1cccs1)-c1ccccc1
: