Target
Sodium channel protein type 9 subunit alpha
Ligand
BDBM50521569
Substrate
Meas. Tech.
ChEMBL_1884747 (CHEMBL4386329)
Ki
0.930000±n/a nM
Citation
 McKerrall, SJNguyen, TLai, KWBergeron, PDeng, LDiPasquale, AChang, JHChen, JChernov-Rogan, THackos, DHMaher, JOrtwine, DFPang, JPayandeh, JProctor, WRShields, SDVogt, JJi, PLiu, WBallini, ESchumann, LTarozzo, GBankar, GChowdhury, SHasan, AJohnson, JPKhakh, KLin, SCohen, CJDehnhardt, CMSafina, BSSutherlin, DP Structure- and Ligand-Based Discovery of Chromane Arylsulfonamide Na J Med Chem 62:4091-4109 (2019)  
Target
Name:
Sodium channel protein type 9 subunit alpha
Synonyms:
NENA Peripheral sodium channel 1 SCN9A_HUMAN Voltage-gated sodium channel subunit Nav1.7 hNE-Na
Type:
Protein
Mol. Mass.:
226375.97
Organism:
Homo sapiens (Human)
Description:
Q15858
Residue:
1988
  
Inhibitor
Name:
BDBM50521569
Synonyms:
CHEMBL4446868
Type:
Small organic molecule
Emp. Form.:
C23H24F4N6O3S
Mol. Mass.:
540.534
SMILES:
Cn1nccc1[C@H]1C[C@H](CCN1[C@H]1CCOc2cc(c(F)cc12)S(=O)(=O)Nc1ccncn1)C(F)(F)F
: