Target
Poly [ADP-ribose] polymerase tankyrase-1/tankyrase-2
Ligand
BDBM50511566
Substrate
Meas. Tech.
ChEMBL_1886448 (CHEMBL4388125)
IC50
78±n/a nM
Citation
 Shirai, FTsumura, TYashiroda, YYuki, HNiwa, HSato, SChikada, TKoda, YWashizuka, KYoshimoto, NAbe, MOnuki, TMazaki, YHirama, CFukami, TWatanabe, HHonma, TUmehara, TShirouzu, MOkue, MKano, YWatanabe, TKitamura, KShitara, EMuramatsu, YYoshida, HMizutani, ASeimiya, HYoshida, MKoyama, H Discovery of Novel Spiroindoline Derivatives as Selective Tankyrase Inhibitors. J Med Chem 62:3407-3427 (2019)  
Target
Name:
Poly [ADP-ribose] polymerase tankyrase-1/tankyrase-2
Synonyms:
Tankyrase 1/2
Type:
Mol. Mass.:
Description:
ASSAY_ID of ChEMBL is 1985233
Components:
This complex has 2 components.
Component 1
Name:
Poly [ADP-ribose] polymerase tankyrase-2
Synonyms:
(ARTD6 or PARP5b) Poly [ADP-ribose] polymerase tankyrase-2 TNKL TNKS2_HUMAN Tankyrase 2 Tankyrase-2 Tankyrase-2 (TNKS2)
Type:
Enzyme
Mol. Mass.:
126937.16
Organism:
Homo sapiens (Human)
Description:
Q9H2K2
Residue:
1166
  
Component 2
Name:
Poly [ADP-ribose] polymerase tankyrase-1
Synonyms:
(ARTD5 or PARP5a) PARPL Poly [ADP-ribose] polymerase tankyrase-1 TINF1 TNKS1 Tankyrase 1 Tankyrase-1 Tankyrase-1 (TNKS1)
Type:
Enzyme
Mol. Mass.:
142058.03
Organism:
Homo sapiens (Human)
Description:
O95271
Residue:
1327
  
Inhibitor
Name:
BDBM50511566
Synonyms:
CHEMBL4448872
Type:
Small organic molecule
Emp. Form.:
C22H26F2N4O2
Mol. Mass.:
416.4642
SMILES:
OCCN1CC2(CCN(CC2)c2nc3CCCCc3c(=O)[nH]2)c2c1cc(F)cc2F
: