Target
Sodium-dependent serotonin transporter
Ligand
BDBM50085069
Substrate
Meas. Tech.
ChEMBL_201483 (CHEMBL805240)
Ki
427±n/a nM
Citation
 Xing, DChen, PKeil, RKilts, CDShi, BCamp, VMMalveaux, GEly, TOwens, MJVotaw, JDavis, MHoffman, JMBaKay, RASubramanian, TWatts, RLGoodman, MM Synthesis, biodistribution, and primate imaging of fluorine-18 labeled 2beta-carbo-1'-fluoro-2-propoxy-3beta-(4-chlorophenyl)tr opanes. Ligands for the imaging of dopamine transporters by positron emission tomography. J Med Chem 43:639-48 (2000)  
Target
Name:
Sodium-dependent serotonin transporter
Synonyms:
5-HT Transporter 5HTT SC6A4_HUMAN SLC6A4 Serotonin transporter (5HTT) Sodium-dependent serotonin transporter (SERT) | Solute carrier family 6 member 4
Type:
Multi-pass membrane protein
Mol. Mass.:
70322.51
Organism:
Homo sapiens (Human)
Description:
P31645
Residue:
630
  
Inhibitor
Name:
BDBM50085069
Synonyms:
3-(4-Chloro-phenyl)-6-methyl-6-aza-bicyclo[3.2.2]nonane-4-carboxylic acid isopropyl ester | CHEMBL345689
Type:
Small organic molecule
Emp. Form.:
C19H26ClNO2
Mol. Mass.:
335.868
SMILES:
CC(C)OC(=O)C1C2CCC(CN2C)C[C@@H]1c1ccc(Cl)cc1
: