Target
Coagulation factor X
Ligand
BDBM50088924
Substrate
Meas. Tech.
ChEBML_48830
Ki
0.600000±n/a nM
Citation
 Arnaiz, DOZhao, ZLiang, ATrinh, LWitlow, MKoovakkat, SKShaw, KJ Design, synthesis, and in vitro biological activity of indole-based factor Xa inhibitors. Bioorg Med Chem Lett 10:957-61 (2000)  
Target
Name:
Coagulation factor X
Synonyms:
Activated coagulation factor X (FXa) Coagulation factor X precursor F10 Factor X heavy chain Factor Xa Stuart-Prower factor
Type:
Enzyme
Mol. Mass.:
54726.60
Organism:
Homo sapiens (Human)
Description:
Residue:
488
  
Inhibitor
Name:
BDBM50088924
Synonyms:
1-(7-Carbamimidoyl-naphthalen-2-ylmethyl)-6-[1-(1-imino-ethyl)-piperidin-4-yloxy]-1H-indole-2-carboxylic acid ethyl ester | CHEMBL433600
Type:
Small organic molecule
Emp. Form.:
C30H33N5O3
Mol. Mass.:
511.6147
SMILES:
CCOC(=O)c1cc2ccc(OC3CCN(CC3)C(C)=N)cc2n1Cc1ccc2ccc(cc2c1)C(N)=N
: