Target
Neuronal acetylcholine receptor subunit alpha-3/beta-4
Ligand
BDBM50534293
Substrate
Meas. Tech.
ChEMBL_1928149 (CHEMBL4431221)
Ki
21±n/a nM
Citation
 Sarasamkan, JScheunemann, MApaijai, NPalee, SParichatikanond, WArunrungvichian, KFischer, SChattipakorn, SDeuther-Conrad, WSchüürmann, GBrust, PVajragupta, O Varying Chirality Across Nicotinic Acetylcholine Receptor Subtypes: Selective Binding of Quinuclidine Triazole Compounds. ACS Med Chem Lett 7:890-895 (2016)  
Target
Name:
Neuronal acetylcholine receptor subunit alpha-3/beta-4
Synonyms:
Neuronal acetylcholine receptor protein alpha-3/beta-4 subunit | Neuronal acetylcholine receptor; alpha3/beta4
Type:
Mol. Mass.:
Description:
ASSAY_ID of ChEMBL is 1970247
Components:
This complex has 2 components.
Component 1
Name:
Neuronal acetylcholine receptor subunit beta-4
Synonyms:
ACHB4_HUMAN Cholinergic, Nicotinic Alpha6Beta3Beta4Alpha5 Nicotinic acetylcholine receptor alpha6/alpha3/beta4
Type:
Enzyme Catalytic Domain
Mol. Mass.:
56388.51
Organism:
Homo sapiens (Human)
Description:
Cholinergic, Nicotinic Alpha6Beta3Beta4Alpha5 0 HUMAN::P30926
Residue:
498
  
Component 2
Name:
Neuronal acetylcholine receptor subunit alpha-3
Synonyms:
ACHA3_HUMAN Cholinergic, Nicotinic Alpha3Beta2 Cholinergic, Nicotinic Alpha3Beta4x NACHRA3 Neuronal acetylcholine receptor subunit alpha-3 nicotinic central
Type:
Enzyme Catalytic Domain
Mol. Mass.:
57479.03
Organism:
Homo sapiens (Human)
Description:
Cholinergic, Nicotinic Alpha3Beta2 0 HUMAN::P32297
Residue:
505
  
Inhibitor
Name:
BDBM50534293
Synonyms:
CHEMBL3341966
Type:
Small organic molecule
Emp. Form.:
C12H12F3N
Mol. Mass.:
227.2256
SMILES:
[H][C@@]12C[C@@]([H])(CNC1)c1cc(ccc21)C(F)(F)F
: