Target
Coagulation factor X
Ligand
BDBM12751
Substrate
Meas. Tech.
ChEMBL_48951 (CHEMBL661664)
Ki
0.030±n/a nM
Citation
 Fevig, JMPinto, DJHan, QQuan, MLPruitt, JRJacobson, ICGalemmo, RAWang, SOrwat, MJBostrom, LLKnabb, RMWong, PCLam PYS, naWexler, RR Synthesis and SAR of benzamidine factor Xa inhibitors containing a vicinally-substituted heterocyclic core. Bioorg Med Chem Lett 11:641-5 (2001)  
Target
Name:
Coagulation factor X
Synonyms:
Activated coagulation factor X (FXa) Coagulation factor X precursor F10 Factor X heavy chain Factor Xa Stuart-Prower factor
Type:
Enzyme
Mol. Mass.:
54726.60
Organism:
Homo sapiens (Human)
Description:
Residue:
488
  
Inhibitor
Name:
BDBM12751
Synonyms:
1-(3-carbamimidoylphenyl)-3-methyl-N-[4-(2-sulfamoylphenyl)phenyl]-1H-pyrazole-5-carboxamide CHEMBL37251 | SN-429
Type:
Small organic molecule
Emp. Form.:
C24H22N6O3S
Mol. Mass.:
474.535
SMILES:
Cc1cc(C(=O)Nc2ccc(cc2)-c2ccccc2S(N)(=O)=O)n(n1)-c1cccc(c1)C(N)=N
: