Target
Endothelin-converting enzyme 1
Ligand
BDBM50541448
Substrate
Meas. Tech.
ChEMBL_1984309 (CHEMBL4617715)
IC50
431000±n/a nM
Citation
 Hecker, SJReddy, KRLomovskaya, OGriffith, DCRubio-Aparicio, DNelson, KTsivkovski, RSun, DSabet, MTarazi, ZParkinson, JTotrov, MBoyer, SHGlinka, TWPemberton, OAChen, YDudley, MN Discovery of Cyclic Boronic Acid QPX7728, an Ultrabroad-Spectrum Inhibitor of Serine and Metallo-?-lactamases. J Med Chem 63:7491-7507 (2020)  
Target
Name:
Endothelin-converting enzyme 1
Synonyms:
ECE-1 ECE1_HUMAN Endothelin-converting enzyme 1 (ECE1)
Type:
Enzyme
Mol. Mass.:
87155.11
Organism:
Homo sapiens (Human)
Description:
P42892
Residue:
770
  
Inhibitor
Name:
BDBM50541448
Synonyms:
CHEMBL4633785
Type:
Small organic molecule
Emp. Form.:
C10H8BFO4
Mol. Mass.:
221.978
SMILES:
[H][C@@]12C[C@]1([H])c1ccc(F)c(C(O)=O)c1OB2O
: