Target
Carbapenem-hydrolyzing beta-lactamase KPC
Ligand
BDBM50541450
Substrate
Meas. Tech.
ChEMBL_1984272 (CHEMBL4617678)
Ki
150±n/a nM
Citation
 Hecker, SJReddy, KRLomovskaya, OGriffith, DCRubio-Aparicio, DNelson, KTsivkovski, RSun, DSabet, MTarazi, ZParkinson, JTotrov, MBoyer, SHGlinka, TWPemberton, OAChen, YDudley, MN Discovery of Cyclic Boronic Acid QPX7728, an Ultrabroad-Spectrum Inhibitor of Serine and Metallo-?-lactamases. J Med Chem 63:7491-7507 (2020)  
Target
Name:
Carbapenem-hydrolyzing beta-lactamase KPC
Synonyms:
BLKPC_KLEOX bla kpc2
Type:
Protein
Mol. Mass.:
31116.99
Organism:
Description:
Q848S6
Residue:
293
 
Inhibitor
Name:
BDBM50541450
Synonyms:
CHEMBL4640702
Type:
Small organic molecule
Emp. Form.:
C11H9BN2O4S2
Mol. Mass.:
308.141
SMILES:
OB1Oc2c(C[C@@H]1Sc1nncs1)cccc2C(O)=O
: