Target
Carbapenem-hydrolyzing beta-lactamase KPC
Ligand
BDBM50089084
Substrate
Meas. Tech.
ChEMBL_1984272 (CHEMBL4617678)
Ki
56±n/a nM
Citation
 Hecker, SJReddy, KRLomovskaya, OGriffith, DCRubio-Aparicio, DNelson, KTsivkovski, RSun, DSabet, MTarazi, ZParkinson, JTotrov, MBoyer, SHGlinka, TWPemberton, OAChen, YDudley, MN Discovery of Cyclic Boronic Acid QPX7728, an Ultrabroad-Spectrum Inhibitor of Serine and Metallo-?-lactamases. J Med Chem 63:7491-7507 (2020)  
Target
Name:
Carbapenem-hydrolyzing beta-lactamase KPC
Synonyms:
BLKPC_KLEOX bla kpc2
Type:
Protein
Mol. Mass.:
31116.99
Organism:
Description:
Q848S6
Residue:
293
 
Inhibitor
Name:
BDBM50089084
Synonyms:
CHEMBL3317857 | Vaborbactam
Type:
Small organic molecule
Emp. Form.:
C12H16BNO5S
Mol. Mass.:
297.135
SMILES:
OB1O[C@H](CC(O)=O)CC[C@@H]1NC(=O)Cc1cccs1
: