Target
Toll-like receptor 8
Ligand
BDBM50543164
Substrate
Meas. Tech.
ChEMBL_1988675 (CHEMBL4622222)
IC50
270±n/a nM
Citation
 Knoepfel, TNimsgern, PJacquier, SBourrel, MVangrevelinghe, EGlatthar, RBehnke, DAlper, PBMichellys, PYDeane, JJunt, TZipfel, GLimonta, SHawtin, SAndre, CBoulay, TLoetscher, PFaller, MBlank, JFeifel, RBetschart, C Target-Based Identification and Optimization of 5-Indazol-5-yl Pyridones as Toll-like Receptor 7 and 8 Antagonists Using a Biochemical TLR8 Antagonist Competition Assay. J Med Chem 63:8276-8295 (2020)  
Target
Name:
Toll-like receptor 8
Synonyms:
CD_antigen: CD288 TLR8_HUMAN | TRL8
Type:
Enzyme
Mol. Mass.:
119828.77
Organism:
Homo sapiens (Human)
Description:
Q9NR97
Residue:
1041
  
Inhibitor
Name:
BDBM50543164
Synonyms:
CHEMBL4632846
Type:
Small organic molecule
Emp. Form.:
C21H20F4N4O
Mol. Mass.:
420.4033
SMILES:
F[C@H]1CNCC[C@H]1n1cc2cc(cc(c2n1)C(F)(F)F)-c1ccc(=O)n2CCCc12
: