Target
Phospholipase A and acyltransferase 5
Ligand
BDBM50544587
Substrate
Meas. Tech.
ChEMBL_1993180 (CHEMBL4626915)
IC50
10.0±n/a nM
Citation
 Zhou, JMock, EDAl Ayed, KDi, XKantae, VBurggraaff, LStevens, AFMartella, AMohr, FJiang, Mvan der Wel, TWendel, TJOfman, TPTran, Yde Koster, Nvan Westen, GJPHankemeier, Tvan der Stelt, M Structure-Activity Relationship Studies of ?-Ketoamides as Inhibitors of the Phospholipase A and Acyltransferase Enzyme Family. J Med Chem 63:9340-9359 (2020)  
Target
Name:
Phospholipase A and acyltransferase 5
Synonyms:
2.3.1.- 3.1.1.4 H-rev107-like protein 5 HRASLS5 HRSL5 PLAT5_HUMAN iNAT
Type:
PROTEIN
Mol. Mass.:
30316.43
Organism:
Homo sapiens
Description:
ChEMBL_119943
Residue:
279
  
Inhibitor
Name:
BDBM50544587
Synonyms:
CHEMBL4639478
Type:
Small organic molecule
Emp. Form.:
C19H20BrNO2
Mol. Mass.:
374.272
SMILES:
Brc1ccc(CCNC(=O)C(=O)CCCc2ccccc2)cc1
: