Target
Microtubule-associated protein 2
Ligand
BDBM50547179
Substrate
Meas. Tech.
ChEMBL_2017292 (CHEMBL4670870)
IC50
6.3±n/a nM
Citation
 Hirst, DJBrandt, MBruton, GChristodoulou, ECutler, LDeeks, NGoodacre, JDJack, TLindon, MMiah, APage, KParr, NShukla, LSims, MThomas, PThorpe, JHolmes, DS Structure-based optimisation of orally active & reversible MetAP-2 inhibitors maintaining a tight 'molecular budget'. Bioorg Med Chem Lett 30:0 (2020)  
Target
Name:
Microtubule-associated protein 2
Synonyms:
MAP-2 MTAP2_HUMAN
Type:
PROTEIN
Mol. Mass.:
199423.64
Organism:
Homo sapiens (Human)
Description:
ChEMBL_107603
Residue:
1827
  
Inhibitor
Name:
BDBM50547179
Synonyms:
CHEMBL4743507
Type:
Small organic molecule
Emp. Form.:
C16H12ClFN2O2
Mol. Mass.:
318.73
SMILES:
COc1ccccc1-c1c([nH]c2cc(F)c(Cl)cc12)C(N)=O
: