Target
Endothelin-1 receptor
Ligand
BDBM50106407
Substrate
Meas. Tech.
ChEMBL_65640 (CHEMBL681522)
Ki
0.039±n/a nM
Citation
 Jae, HSWinn, Mvon Geldern, TWSorensen, BKChiou, WJNguyen, BMarsh, KCOpgenorth, TJ Pyrrolidine-3-carboxylic acids as endothelin antagonists. 5. Highly selective, potent, and orally active ET(A) antagonists. J Med Chem 44:3978-84 (2001)  
Target
Name:
Endothelin-1 receptor
Synonyms:
EDNRA ET-A ETA-R Endothelin receptor type A hET-AR
Type:
Enzyme Catalytic Domain
Mol. Mass.:
48736.88
Organism:
Homo sapiens (Human)
Description:
P25101
Residue:
427
  
Inhibitor
Name:
BDBM50106407
Synonyms:
1-Dibutylcarbamoylmethyl-4-(2,3-dihydro-benzofuran-5-yl)-2-(3-fluoro-4-methyl-phenyl)-pyrrolidine-3-carboxylic acid | CHEMBL128818
Type:
Small organic molecule
Emp. Form.:
C30H39FN2O4
Mol. Mass.:
510.6401
SMILES:
CCCCN(CCCC)C(=O)CN1C[C@@H]([C@H]([C@@H]1c1ccc(C)c(F)c1)C(O)=O)c1ccc2OCCc2c1
: