Target
Potassium voltage-gated channel subfamily H member 2
Ligand
BDBM50370595
Substrate
Meas. Tech.
ChEMBL_2022612 (CHEMBL4676425)
IC50
>10000±n/a nM
Citation
 García, MVirgili, MAlonso, MAlegret, CFarran, JFernández, BBordas, MPascual, RBurgueño, JVidal-Torres, AFernández de Henestrosa, ARAyet, EMerlos, MVela, JMPlata-Salamán, CRAlmansa, C Discovery of EST73502, a Dual ?-Opioid Receptor Agonist and ? J Med Chem 63:15508-15526 (2020)  
Target
Name:
Potassium voltage-gated channel subfamily H member 2
Synonyms:
1,3-beta-glucan synthase component GLS2 ERG Eag-related protein 1 Ether-a-go-go-related gene (HERG) Ether-a-go-go-related gene potassium channel 1 Ether-a-go-go-related gene potassium channel 1 (hERG1) Ether-a-go-go-related protein 1 H-ERG KCNH2 Potassium voltage-gated channel subfamily H member 2 (hERG) Voltage-gated potassium channel subunit Kv11.1 hERG Potassium Channel 1 | putative potassium channel subunit
Type:
Multi-pass membrane protein
Mol. Mass.:
126672.65
Organism:
Homo sapiens (Human)
Description:
Q12809
Residue:
1159
  
Inhibitor
Name:
BDBM50370595
Synonyms:
OXYCODONE US1184575, oxycodone | US9233167, Oxycodone
Type:
Small organic molecule
Emp. Form.:
C18H21NO4
Mol. Mass.:
315.3636
SMILES:
COc1ccc2C[C@H]3N(C)CC[C@@]45[C@@H](Oc1c24)C(=O)CC[C@@]35O
: