Target
Glucocorticoid receptor
Ligand
BDBM50550122
Substrate
Meas. Tech.
ChEMBL_2026431 (CHEMBL4680589)
Kd
138±n/a nM
Citation
 Zimmerman, JAOFang, MDoumbia, BNeyman, ACha, JHThomas, MHall, BWu, MWilson, AMPufall, MA Deacylcortivazol-like pyrazole regioisomers reveal a more accommodating expanded binding pocket for the glucocorticoid receptor. RSC Med Chem 12:203-212 (2021)  
Target
Name:
Glucocorticoid receptor
Synonyms:
GCR_HUMAN GRL Glucocorticoid receptor (GRFP) Nuclear receptor subfamily 3 group C member 1
Type:
Enzyme
Mol. Mass.:
85656.87
Organism:
Homo sapiens (Human)
Description:
P04150
Residue:
777
  
Inhibitor
Name:
BDBM50550122
Synonyms:
CHEMBL4754182
Type:
Small organic molecule
Emp. Form.:
C28H33FN2O4
Mol. Mass.:
480.571
SMILES:
[H][C@@]12CC[C@](O)(C(=O)CO)[C@@]1(C)C[C@H](O)[C@@]1([H])[C@@]2([H])CCC2=Cc3nn(cc3C[C@]12C)-c1ccc(F)cc1
: