Target
Neuropeptide Y receptor type 5
Ligand
BDBM50116592
Substrate
Meas. Tech.
ChEMBL_143681 (CHEMBL756248)
IC50
37±n/a nM
Citation
 Block, MHBoyer, SBrailsford, WBrittain, DRCarroll, DChapman, SClarke, DSDonald, CSFoote, KMGodfrey, LLadner, AMarsham, PRMasters, DJMee, CDO'Donovan, MRPease, JEPickup, AGRayner, JWRoberts, ASchofield, PSuleman, ATurnbull, AV Discovery and optimization of a series of carbazole ureas as NPY5 antagonists for the treatment of obesity. J Med Chem 45:3509-23 (2002)  
Target
Name:
Neuropeptide Y receptor type 5
Synonyms:
NPY-Y5 NPY5-R NPY5R_HUMAN NPYY5 Neuropeptide Y receptor type 5 ( NPY Y5) | Y5 receptor
Type:
Enzyme
Mol. Mass.:
50746.64
Organism:
Homo sapiens (Human)
Description:
Q15761
Residue:
445
  
Inhibitor
Name:
BDBM50116592
Synonyms:
CHEMBL325226 | Morpholine-4-carboxylic acid (9-isopropyl-4-methyl-9H-carbazol-3-yl)-amide
Type:
Small organic molecule
Emp. Form.:
C21H25N3O2
Mol. Mass.:
351.4421
SMILES:
CC(C)n1c2ccccc2c2c(C)c(NC(=O)N3CCOCC3)ccc12
: