Target
Inosine-5'-monophosphate dehydrogenase 2
Ligand
BDBM50119123
Substrate
Meas. Tech.
ChEMBL_89935 (CHEMBL699561)
IC50
800±n/a nM
Citation
 Iwanowicz, EJWatterson, SHLiu, CGu, HHMitt, TLeftheris, KBarrish, JCFleener, CARouleau, KSherbina, NZHollenbaugh, DL Novel guanidine-based inhibitors of inosine monophosphate dehydrogenase. Bioorg Med Chem Lett 12:2931-4 (2002)  
Target
Name:
Inosine-5'-monophosphate dehydrogenase 2
Synonyms:
IMDH2_HUMAN IMPD 2 IMPDH-II Inosine 5'-monophosphate dehydrogenase II (IMPDH II) Inosine-5 -monophosphate dehydrogenase 2 | Inosine-5'-monophosphate dehydrogenase (IMPDH)
Type:
Enzyme
Mol. Mass.:
55806.87
Organism:
Homo sapiens (Human)
Description:
Recombinant IMPDH2 expressed in E. coli.
Residue:
514
  
Inhibitor
Name:
BDBM50119123
Synonyms:
CHEMBL329714 | N-Benzoyl-N'-(3-methoxy-4-oxazol-5-yl-phenyl)-guanidine
Type:
Small organic molecule
Emp. Form.:
C18H16N4O3
Mol. Mass.:
336.3446
SMILES:
COc1cc(ccc1-c1cnco1)N=C(N)NC(=O)c1ccccc1
: