Target
Stromelysin-1
Ligand
BDBM50121955
Substrate
Meas. Tech.
ChEMBL_205632 (CHEMBL813068)
Kd
170000±n/a nM
Citation
 Hajduk, PJShuker, SBNettesheim, DGCraig, RAugeri, DJBetebenner, DAlbert, DHGuo, YMeadows, RPXu, LMichaelides, MDavidsen, SKFesik, SW NMR-based modification of matrix metalloproteinase inhibitors with improved bioavailability. J Med Chem 45:5628-39 (2002)  
Target
Name:
Stromelysin-1
Synonyms:
MMP-3 MMP3_HUMAN Matrix metalloproteinase 3 Matrix metalloproteinase-3 (MMP-3) SL-1 Stromelysin 1 | Transin-1
Type:
Enzyme
Mol. Mass.:
53973.13
Organism:
Homo sapiens (Human)
Description:
P08254
Residue:
477
  
Inhibitor
Name:
BDBM50121955
Synonyms:
4-Phenyl-pyridine US11634391, Compound 233
Type:
Small organic molecule
Emp. Form.:
C11H9N
Mol. Mass.:
155.1959
SMILES:
c1ccc(cc1)-c1ccncc1
: