Target
Glucagon receptor
Ligand
BDBM50110074
Substrate
Meas. Tech.
ChEMBL_72875 (CHEMBL684126)
IC50
4.3±n/a nM
Citation
 Madsen, PLing, APlewe, MSams, CKKnudsen, LBSidelmann, UGYnddal, LBrand, CLAndersen, BMurphy, DTeng, MTruesdale, LKiel, DMay, JKuki, AShi, SJohnson, MDTeston, KAFeng, JLakis, JAnderes, KGregor, VLau, J Optimization of alkylidene hydrazide based human glucagon receptor antagonists. Discovery of the highly potent and orally available 3-cyano-4-hydroxybenzoic acid [1-(2,3,5,6-tetramethylbenzyl)-1H-indol-4-ylmethylene]hydrazide. J Med Chem 45:5755-75 (2002)  
Target
Name:
Glucagon receptor
Synonyms:
GCGR GLR_HUMAN Glucagon receptor (GlucR)
Type:
Enzyme
Mol. Mass.:
54026.92
Organism:
Homo sapiens (Human)
Description:
P47871
Residue:
477
  
Inhibitor
Name:
BDBM50110074
Synonyms:
3-Chloro-4-hydroxy-benzoic acid [1-[4-(4-isopropyl-benzyloxy)-naphthalen-1-yl]-meth-(E)-ylidene]-hydrazide CHEMBL348702
Type:
Small organic molecule
Emp. Form.:
C28H25ClN2O3
Mol. Mass.:
472.963
SMILES:
CC(C)c1ccc(COc2ccc(\C=N\NC(=O)c3ccc(O)c(Cl)c3)c3ccccc23)cc1
: