Target
Sphingomyelin phosphodiesterase 2
Ligand
BDBM50122309
Substrate
Meas. Tech.
ChEMBL_144777 (CHEMBL751443)
Ki
1600±n/a nM
Citation
 Yokomatsu, TMurano, TAkiyama, TKoizumi, JShibuya, STsuji, YSoeda, SShimeno, H Synthesis of non-competitive inhibitors of sphingomyelinases with significant activity. Bioorg Med Chem Lett 13:229-36 (2002)  
Target
Name:
Sphingomyelin phosphodiesterase 2
Synonyms:
Lyso-PAF-PLC N-SMase Neutral sphingomyelinase Sphingomyelin phosphodiesterase 2 | nSMase
Type:
PROTEIN
Mol. Mass.:
47650.63
Organism:
Homo sapiens (Human)
Description:
ChEMBL_144777
Residue:
423
  
Inhibitor
Name:
BDBM50122309
Synonyms:
((3S,4R)-1,1-Difluoro-3-hexadecanoylamino-4-hydroxy-4-phenyl-butyl)-phosphonic acid | CHEMBL310981
Type:
Small organic molecule
Emp. Form.:
C26H44F2NO5P
Mol. Mass.:
519.6018
SMILES:
CCCCCCCCCCCCCCCC(=O)N[C@@H](CC(F)(F)P(O)(O)=O)[C@H](O)c1ccccc1
: