Target
Prothrombin
Ligand
BDBM50123503
Substrate
Meas. Tech.
ChEMBL_210607 (CHEMBL816574)
Ki
1±n/a nM
Citation
 Burgey, CSRobinson, KALyle, TASanderson, PELewis, SDLucas, BJKrueger, JASingh, RMiller-Stein, CWhite, RBWong, BLyle, EAWilliams, PDCoburn, CADorsey, BDBarrow, JCStranieri, MTHolahan, MASitko, GRCook, JJMcMasters, DRMcDonough, CMSanders, WMWallace, AAClayton, FCBohn, DLeonard, YMDetwiler, TJLynch, JJYan, YChen, ZKuo, LGardell, SJShafer, JAVacca, JP Metabolism-directed optimization of 3-aminopyrazinone acetamide thrombin inhibitors. Development of an orally bioavailable series containing P1 and P3 pyridines. J Med Chem 46:461-73 (2003)  
Target
Name:
Prothrombin
Synonyms:
Activation peptide fragment 1 Coagulation factor II Prothrombin precursor Thrombin heavy chain | Thrombin light chain
Type:
Protein
Mol. Mass.:
70029.57
Organism:
Homo sapiens (Human)
Description:
P00734
Residue:
622
  
Inhibitor
Name:
BDBM50123503
Synonyms:
2-[3-(2,2-Difluoro-2-pyridin-2-yl-ethylamino)-6-methyl-2-oxo-2H-pyrazin-1-yl]-N-(3-fluoro-4-methyl-pyridin-2-ylmethyl)-acetamide | CHEMBL143824
Type:
Small organic molecule
Emp. Form.:
C21H21F3N6O2
Mol. Mass.:
446.4256
SMILES:
Cc1ccnc(CNC(=O)Cn2c(C)cnc(NCC(F)(F)c3ccccn3)c2=O)c1F
: