Target
Prothrombin
Ligand
BDBM50123505
Substrate
Meas. Tech.
ChEMBL_210607 (CHEMBL816574)
Ki
1.6±n/a nM
Citation
 Burgey, CSRobinson, KALyle, TASanderson, PELewis, SDLucas, BJKrueger, JASingh, RMiller-Stein, CWhite, RBWong, BLyle, EAWilliams, PDCoburn, CADorsey, BDBarrow, JCStranieri, MTHolahan, MASitko, GRCook, JJMcMasters, DRMcDonough, CMSanders, WMWallace, AAClayton, FCBohn, DLeonard, YMDetwiler, TJLynch, JJYan, YChen, ZKuo, LGardell, SJShafer, JAVacca, JP Metabolism-directed optimization of 3-aminopyrazinone acetamide thrombin inhibitors. Development of an orally bioavailable series containing P1 and P3 pyridines. J Med Chem 46:461-73 (2003)  
Target
Name:
Prothrombin
Synonyms:
Activation peptide fragment 1 Coagulation factor II Prothrombin precursor Thrombin heavy chain | Thrombin light chain
Type:
Protein
Mol. Mass.:
70029.57
Organism:
Homo sapiens (Human)
Description:
P00734
Residue:
622
  
Inhibitor
Name:
BDBM50123505
Synonyms:
CHEMBL143421 | N-(6-Amino-2-methyl-pyridin-3-ylmethyl)-2-[6-methyl-2-oxo-3-(2-pyridin-4-yl-ethylamino)-2H-pyrazin-1-yl]-acetamide
Type:
Small organic molecule
Emp. Form.:
C21H25N7O2
Mol. Mass.:
407.4689
SMILES:
Cc1nc(N)ccc1CNC(=O)Cn1c(C)cnc(NCCc2ccncc2)c1=O
: