Target
Coagulation factor X
Ligand
BDBM50123789
Substrate
Meas. Tech.
ChEMBL_48660 (CHEMBL657275)
Ki
23±n/a nM
Citation
 Choi-Sledeski, YMKearney, RPoli, GPauls, HGardner, CGong, YBecker, MDavis, RSpada, ALiang, GChu, VBrown, KCollussi, DLeadley, RRebello, SMoxey, PMorgan, SBentley, RKasiewski, CMaignan, SGuilloteau, JPMikol, V Discovery of an orally efficacious inhibitor of coagulation factor Xa which incorporates a neutral P1 ligand. J Med Chem 46:681-4 (2003)  
Target
Name:
Coagulation factor X
Synonyms:
Activated coagulation factor X (FXa) Coagulation factor X precursor F10 Factor X heavy chain Factor Xa Stuart-Prower factor
Type:
Enzyme
Mol. Mass.:
54726.60
Organism:
Homo sapiens (Human)
Description:
Residue:
488
  
Inhibitor
Name:
BDBM50123789
Synonyms:
4-(5'-Chloro-[2,2']bithiophenyl-5-sulfonyl)-1-(1H-pyrrolo[3,2-c]pyridin-2-ylmethyl)-piperazin-2-one | CHEMBL350963
Type:
Small organic molecule
Emp. Form.:
C20H17ClN4O3S3
Mol. Mass.:
493.022
SMILES:
Clc1ccc(s1)-c1ccc(s1)S(=O)(=O)N1CCN(Cc2cc3cnccc3[nH]2)C(=O)C1
: