Target
2-hydroxyacylsphingosine 1-beta-galactosyltransferase
Ligand
BDBM50561670
Substrate
Meas. Tech.
ChEMBL_2075686 (CHEMBL4731220)
IC50
1.1±n/a nM
Citation
 Thurairatnam, SLim, SBarker, RHChoi-Sledeski, YMHirth, BHJiang, JMacor, JEMakino, EManiar, SMusick, KPribish, JRMunson, M Brain Penetrable Inhibitors of Ceramide Galactosyltransferase for the Treatment of Lysosomal Storage Disorders. ACS Med Chem Lett 11:2010-2016 (2020)  
Target
Name:
2-hydroxyacylsphingosine 1-beta-galactosyltransferase
Synonyms:
2-hydroxyacylsphingosine 1-beta-galactosyltransferase CGT Ceramide UDP-galactosyltransferase UDP-galactose-ceramide galactosyltransferase UGT8
Type:
PROTEIN
Mol. Mass.:
61470.74
Organism:
Homo sapiens
Description:
ChEMBL_120191
Residue:
541
  
Inhibitor
Name:
BDBM50561670
Synonyms:
CHEMBL4750073
Type:
Small organic molecule
Emp. Form.:
C21H25F3N4O3S
Mol. Mass.:
470.508
SMILES:
CNC(=O)c1csc2c(cc(nc12)N1CCC(CC1)OC(=O)N[C@@H](C)C1CC1)C(F)(F)F
: