Target
5-hydroxytryptamine receptor 2C
Ligand
BDBM50130088
Substrate
Meas. Tech.
ChEBML_3044
Ki
59.0±n/a nM
Citation
 Ennis, MDHoffman, RLGhazal, NBOlson, RMKnauer, CSChio, CLHyslop, DKCampbell, JEFitzgerald, LWNichols, NFSvensson, KAMcCall, RBHaber, CLKagey, MLDinh, DM 2,3,4,5-tetrahydro- and 2,3,4,5,11,11a-hexahydro-1H-[1,4]diazepino[1,7-a]indoles: new templates for 5-HT(2C) agonists. Bioorg Med Chem Lett 13:2369-72 (2003)  
Target
Name:
5-hydroxytryptamine receptor 2C
Synonyms:
5-HT-2C 5-HT2C-INI 5-HTR2C 5-hydroxytryptamine receptor 2C (5-HT-2C) 5HT-1C HTR1C Serotonin (5-HT3) receptor Serotonin Receptor 2C
Type:
G Protein-Coupled Receptor (GPCR)
Mol. Mass.:
51836.79
Organism:
Homo sapiens (Human)
Description:
P28335
Residue:
458
  
Inhibitor
Name:
BDBM50130088
Synonyms:
7-(2-Trifluoromethyl-phenyl)-2,3,4,5,11,11a-hexahydro-1H-[1,4]diazepino[1,7-a]indole | CHEMBL77701
Type:
Small organic molecule
Emp. Form.:
C19H19F3N2
Mol. Mass.:
332.3628
SMILES:
FC(F)(F)c1ccccc1-c1cccc2CC3CCNCCN3c12
: