Target
5-hydroxytryptamine receptor 2C
Ligand
BDBM50130081
Substrate
Meas. Tech.
ChEBML_3044
Ki
4.3±n/a nM
Citation
 Ennis, MDHoffman, RLGhazal, NBOlson, RMKnauer, CSChio, CLHyslop, DKCampbell, JEFitzgerald, LWNichols, NFSvensson, KAMcCall, RBHaber, CLKagey, MLDinh, DM 2,3,4,5-tetrahydro- and 2,3,4,5,11,11a-hexahydro-1H-[1,4]diazepino[1,7-a]indoles: new templates for 5-HT(2C) agonists. Bioorg Med Chem Lett 13:2369-72 (2003)  
Target
Name:
5-hydroxytryptamine receptor 2C
Synonyms:
5-HT-2C 5-HT2C-INI 5-HTR2C 5-hydroxytryptamine receptor 2C (5-HT-2C) 5HT-1C HTR1C Serotonin (5-HT3) receptor Serotonin Receptor 2C
Type:
G Protein-Coupled Receptor (GPCR)
Mol. Mass.:
51836.79
Organism:
Homo sapiens (Human)
Description:
P28335
Residue:
458
  
Inhibitor
Name:
BDBM50130081
Synonyms:
1,2,8,9,10,11-Hexahydro-7H-3-oxa-9,11b-diaza-cyclohepta[a]acenaphthylene PHA-57378
Type:
Small organic molecule
Emp. Form.:
C14H16N2O
Mol. Mass.:
228.2896
SMILES:
C1Cn2c3CCNCCc3c3cccc(O1)c23
: