Target
5-hydroxytryptamine receptor 2C
Ligand
BDBM50130098
Substrate
Meas. Tech.
ChEBML_3044
Ki
38±n/a nM
Citation
 Ennis, MDHoffman, RLGhazal, NBOlson, RMKnauer, CSChio, CLHyslop, DKCampbell, JEFitzgerald, LWNichols, NFSvensson, KAMcCall, RBHaber, CLKagey, MLDinh, DM 2,3,4,5-tetrahydro- and 2,3,4,5,11,11a-hexahydro-1H-[1,4]diazepino[1,7-a]indoles: new templates for 5-HT(2C) agonists. Bioorg Med Chem Lett 13:2369-72 (2003)  
Target
Name:
5-hydroxytryptamine receptor 2C
Synonyms:
5-HT-2C 5-HT2C-INI 5-HTR2C 5-hydroxytryptamine receptor 2C (5-HT-2C) 5HT-1C HTR1C Serotonin (5-HT3) receptor Serotonin Receptor 2C
Type:
G Protein-Coupled Receptor (GPCR)
Mol. Mass.:
51836.79
Organism:
Homo sapiens (Human)
Description:
P28335
Residue:
458
  
Inhibitor
Name:
BDBM50130098
Synonyms:
3-Ethyl-2,3,4,5-tetrahydro-1H-[1,4]diazepino[1,7-a]indole | CHEMBL308958
Type:
Small organic molecule
Emp. Form.:
C14H18N2
Mol. Mass.:
214.3061
SMILES:
CCN1CCc2cc3ccccc3n2CC1
: