Target
Acetylcholinesterase
Ligand
BDBM8961
Substrate
Meas. Tech.
ChEBML_27673
IC50
16±n/a nM
Citation
 Herlem, DMartin, MTThal, CGuillou, C Synthesis and structure-activity relationships of open D-Ring galanthamine analogues. Bioorg Med Chem Lett 13:2389-91 (2003)  
Target
Name:
Acetylcholinesterase
Synonyms:
ACES_ELEEL Acetylcholinesterase (EeAChE) | ache
Type:
Enzyme
Mol. Mass.:
71812.79
Organism:
Electrophorus electricus (Electric eel)
Description:
Residue:
633
  
Inhibitor
Name:
BDBM8961
Synonyms:
1,2,3,4-tetrahydro-9-acridinamine 9-THA CHEMBL1337960 Cognex Tracine cid_1935 | tacrine.HCl
Type:
Small organic molecule
Emp. Form.:
C13H14N2
Mol. Mass.:
198.2637
SMILES:
Nc1c2CCCCc2nc2ccccc12
: