Target
Transient receptor potential cation channel subfamily V member 1
Ligand
BDBM50052442
Substrate
Meas. Tech.
ChEMBL_215653 (CHEMBL820263)
Ki
0.13±n/a nM
Citation
 Lee, JLee, JKang, MShin, MKim, JMKang, SULim, JOChoi, HKSuh, YGPark, HGOh, UKim, HDPark, YHHa, HJKim, YHToth, AWang, YTran, RPearce, LVLundberg, DJBlumberg, PM N-(3-acyloxy-2-benzylpropyl)-N'-[4-(methylsulfonylamino)benzyl]thiourea analogues: novel potent and high affinity antagonists and partial antagonists of the vanilloid receptor. J Med Chem 46:3116-26 (2003)  
Target
Name:
Transient receptor potential cation channel subfamily V member 1
Synonyms:
Capsaicin receptor TRPV1_RAT Trpv1 Vanilloid VR1 Vanilloid receptor 1 (VRI/TRPV1) Vanilloid receptor type 1-like (TrpV1/Vr1) Vr1l | osm-9-like TRP channel 1
Type:
Transient Receptor
Mol. Mass.:
94956.12
Organism:
Rattus norvegicus (rat)
Description:
O35433
Residue:
838
  
Inhibitor
Name:
BDBM50052442
Synonyms:
(4-Hydroxy-3-methoxy-phenyl)-acetic acid (2R,3S,3aR,5R,5aR,8bR,11aR)-3b-benzyloxy-11a-hydroxy-5a-isopropenyl-2,4-dimethyl-1-oxo-1,3a,3b,4,5,5a,8a,8b,11,11a-decahydro-6,8-dioxa-indeno[5,4-e]azulen-10-ylmethyl ester 13-benzyl-6-hydroxy-15-isopropenyl-4,17-dimethyl-5-oxo-(1R,2S,6R,10S,11R,15R,17R)-12,14,18-trioxapentacyclo[11.4.1.01,10.02,6.011,15]octadeca-3,8-dien-8-ylmethyl 2-(4-hydroxy-3-methoxyphenyl)acetate CHEMBL448382 Resiniferatoxin(RTX) | resinferatoxin
Type:
Small organic molecule
Emp. Form.:
C37H40O9
Mol. Mass.:
628.7081
SMILES:
COc1cc(CC(=O)OCC2=C[C@H]3[C@H]4O[C@]5(Cc6ccccc6)O[C@]4(C[C@@H](C)[C@]3(O5)[C@@H]3C=C(C)C(=O)[C@@]3(O)C2)C(C)=C)ccc1O
: